Reaction Details
TargetMast/stem cell growth factor receptor Kit
LigandBDBM346017
Substrate/Competitorn/a
Meas. Tech.In Vitro TK Inhibition Assay
EC50<1000±n/a nM
Citation Moussy, ABenjahad, ASchalon, CPez, DChevenier, ESandrinelli, FMartin, JPicoul, W Benzimidazole derivatives as selective proteine kinase inhibitors US Patent US10202370 Publication Date 2/12/2019
 
Mast/stem cell growth factor receptor Kit
Name:Mast/stem cell growth factor receptor Kit
Type:Protein
Mol. Mass.:109869.37
Organism:Homo sapiens (Human)
Description:P10721
Residue:976
BDBM346017
NameBDBM346017
Synonyms:3-[5-Methyl-6-(4- pyridin-3-yl-thiazol- 2-ylamino)-1H- benzoimidazol-2-yl]- benzonitrile | US10202370, Example 010
TypeSmall organic molecule
Emp. Form.C23H16N6S
Mol. Mass.408.478
SMILESCc1cc2nc([nH]c2cc1Nc1nc(cs1)-c1cccnc1)-c1cccc(c1)C#N