Reaction Details
TargetMast/stem cell growth factor receptor Kit
LigandBDBM346063
Substrate/Competitorn/a
Meas. Tech.In Vitro TK Inhibition Assay
EC50<1000±n/a nM
Citation Moussy, ABenjahad, ASchalon, CPez, DChevenier, ESandrinelli, FMartin, JPicoul, W Benzimidazole derivatives as selective proteine kinase inhibitors US Patent US10202370 Publication Date 2/12/2019
 
Mast/stem cell growth factor receptor Kit
Name:Mast/stem cell growth factor receptor Kit
Type:Protein
Mol. Mass.:109869.37
Organism:Homo sapiens (Human)
Description:P10721
Residue:976
BDBM346063
NameBDBM346063
Synonyms:US10202370, Example 101 | [1-Isopropyl-6- methyl-2-(3- trifluoromethyl- phenyl)-1H- benzoimidazol-5-yl]- (4-pyridin-4-yl- thiazol-2-yl)-amine
TypeSmall organic molecule
Emp. Form.C26H22F3N5S
Mol. Mass.493.547
SMILESCC(C)n1c(nc2cc(Nc3nc(cs3)-c3ccncc3)c(C)cc12)-c1cccc(c1)C(F)(F)F