Reaction Details
TargetPhosphatidylinositol 4,5-bisphosphate 3-kinase catalytic subunit alpha isoform
LigandBDBM346172
Substrate/Competitorn/a
Meas. Tech.Biochemical Assays for PI3Kalpha, PI3Kbeta
IC50 78.0±n/a nM
Citation Fairhurst, RAFuret, PKalthoff, FSLerchner, ARueeger, H Oxazolidin-2-one-pyrimidine derivatives and the use thereof as phosphatidylinositol-3-kinase inhibitors US Patent US10202371 Publication Date 2/12/2019
 
Phosphatidylinositol 4,5-bisphosphate 3-kinase catalytic subunit alpha isoform
Name:Phosphatidylinositol 4,5-bisphosphate 3-kinase catalytic subunit alpha isoform
Type:Enzyme Subunit
Mol. Mass.:124294.87
Organism:Homo sapiens (Human)
Description:P42336
Residue:1068
BDBM346172
NameBDBM346172
Synonyms:(4S*,5S*)-3-(2′-amino-2-morpholino-4′-(trifluoromethyl)-[4,5′-bipyrimidin]-6-yl)-4-ethyl-5-(4-methoxyphenyl)oxazolidin-2-one | US10202371, Example 2
TypeSmall organic molecule
Emp. Form.C25H26F3N7O4
Mol. Mass.545.5136
SMILESCC[C@H]1[C@@H](OC(=O)N1c1cc(nc(n1)N1CCOCC1)-c1cnc(N)nc1C(F)(F)F)c1ccc(OC)cc1