Reaction Details
TargetPhosphatidylinositol 4,5-bisphosphate 3-kinase catalytic subunit alpha isoform
LigandBDBM50380377
Substrate/Competitorn/a
Meas. Tech.Biochemical Assays for PI3Kalpha, PI3Kbeta
IC50 16.0±n/a nM
Citation Fairhurst, RAFuret, PKalthoff, FSLerchner, ARueeger, H Oxazolidin-2-one-pyrimidine derivatives and the use thereof as phosphatidylinositol-3-kinase inhibitors US Patent US10202371 Publication Date 2/12/2019
 
Phosphatidylinositol 4,5-bisphosphate 3-kinase catalytic subunit alpha isoform
Name:Phosphatidylinositol 4,5-bisphosphate 3-kinase catalytic subunit alpha isoform
Type:Enzyme Subunit
Mol. Mass.:124294.87
Organism:Homo sapiens (Human)
Description:P42336
Residue:1068
BDBM50380377
NameBDBM50380377
Synonyms:CHEMBL2017977 | WO2007/084786, Compound 85
TypeSmall organic molecule
Emp. Form.C17H20F3N7O2
Mol. Mass.411.3816
SMILESNc1ncc(-c2cc(nc(n2)N2CCOCC2)N2CCOCC2)c(n1)C(F)(F)F