Reaction Details
TargetPhosphatidylinositol 4,5-bisphosphate 3-kinase catalytic subunit delta isoform
LigandBDBM346182
Substrate/Competitorn/a
IC50 4.00±n/a nM
Citation Fairhurst, RAFuret, PKalthoff, FSLerchner, ARueeger, H Oxazolidin-2-one-pyrimidine derivatives and the use thereof as phosphatidylinositol-3-kinase inhibitors US Patent US10202371 Publication Date 2/12/2019
 
Phosphatidylinositol 4,5-bisphosphate 3-kinase catalytic subunit delta isoform
Name:Phosphatidylinositol 4,5-bisphosphate 3-kinase catalytic subunit delta isoform
Type:Enzyme Subunit
Mol. Mass.:119489.41
Organism:Homo sapiens (Human)
Description:O00329
Residue:1044
BDBM346182
NameBDBM346182
Synonyms:US10202371, Example 12
TypeSmall organic molecule
Emp. Form.C26H28F3N7O6
Mol. Mass.591.539
SMILESCOCCOc1ccc(cc1)[C@@H]1OC(=O)N([C@H]1CO)c1cc(nc(n1)N1CCOCC1)-c1cnc(N)nc1C(F)(F)F