Reaction Details
TargetSerine/threonine-protein kinase mTOR
LigandBDBM346181
Substrate/Competitorn/a
Meas. Tech.Biochemical Assay for mTOR
IC50 870±n/a nM
Citation Fairhurst, RAFuret, PKalthoff, FSLerchner, ARueeger, H Oxazolidin-2-one-pyrimidine derivatives and the use thereof as phosphatidylinositol-3-kinase inhibitors US Patent US10202371 Publication Date 2/12/2019
 
Serine/threonine-protein kinase mTOR
Name:Serine/threonine-protein kinase mTOR
Type:Rapamycin target protein
Mol. Mass.:288917.12
Organism:Homo sapiens (Human)
Description:P42345
Residue:2549
BDBM346181
NameBDBM346181
Synonyms:US10202371, Example 11
TypeSmall organic molecule
Emp. Form.C20H19F3N8O3S
Mol. Mass.508.477
SMILESC[C@H]1[C@H](OC(=O)N1c1cc(nc(n1)N1CCOCC1)-c1cnc(N)nc1C(F)(F)F)c1nccs1