Reaction Details
TargetPhosphatidylinositol 4,5-bisphosphate 3-kinase catalytic subunit beta isoform
LigandBDBM346176
Substrate/Competitorn/a
Meas. Tech.Cellular Assays for PI3Kalpha, Beta and Delta
IC50 420±n/a nM
Citation Fairhurst, RAFuret, PKalthoff, FSLerchner, ARueeger, H Oxazolidin-2-one-pyrimidine derivatives and the use thereof as phosphatidylinositol-3-kinase inhibitors US Patent US10202371 Publication Date 2/12/2019
 
Phosphatidylinositol 4,5-bisphosphate 3-kinase catalytic subunit beta isoform
Name:Phosphatidylinositol 4,5-bisphosphate 3-kinase catalytic subunit beta isoform
Type:Enzyme Catalytic Domain
Mol. Mass.:122616.58
Organism:Rattus norvegicus (Rat)
Description:Q9Z1L0
Residue:1070
BDBM346176
NameBDBM346176
Synonyms:US10202371, Example 6
TypeSmall organic molecule
Emp. Form.C25H26F3N7O4
Mol. Mass.545.5136
SMILESCC[C@H]1[C@@H](OC(=O)N1c1cc(nc(n1)N1CCOCC1)-c1cnc(N)nc1C(F)(F)F)c1cccc(OC)c1