Reaction Details
TargetPhosphatidylinositol 4,5-bisphosphate 3-kinase catalytic subunit delta isoform
LigandBDBM346177
Substrate/Competitorn/a
Meas. Tech.Cellular Assays for PI3Kalpha, Beta and Delta
IC50 123±n/a nM
Citation Fairhurst, RAFuret, PKalthoff, FSLerchner, ARueeger, H Oxazolidin-2-one-pyrimidine derivatives and the use thereof as phosphatidylinositol-3-kinase inhibitors US Patent US10202371 Publication Date 2/12/2019
 
Phosphatidylinositol 4,5-bisphosphate 3-kinase catalytic subunit delta isoform
Name:Phosphatidylinositol 4,5-bisphosphate 3-kinase catalytic subunit delta isoform
Type:Enzyme
Mol. Mass.:119725.20
Organism:Mus musculus (Mouse)
Description:O35904
Residue:1043
BDBM346177
NameBDBM346177
Synonyms:US10202371, Example 7
TypeSmall organic molecule
Emp. Form.C21H21F3N8O3S
Mol. Mass.522.503
SMILESCC[C@H]1[C@@H](OC(=O)N1c1cc(nc(n1)N1CCOCC1)-c1cnc(N)nc1C(F)(F)F)c1nccs1