Reaction Details
TargetProtein Wnt-3a
LigandBDBM346255
Substrate/Competitorn/a
Meas. Tech.Dual-Cell beta-Catenin Reporter Assay
IC50 3±n/a nM
Citation Bhamra, IMathieson, MDonoghue, CTestar, R N-pyridinyl acetamide derivatives as Wnt signalling pathway inhibitors US Patent US10202375 Publication Date 2/12/2019
 
Protein Wnt-3a
Name:Protein Wnt-3a
Type:PROTEIN
Mol. Mass.:39269.29
Organism:Mus musculus
Description:ChEMBL_813156
Residue:352
BDBM346255
NameBDBM346255
Synonyms:2-[4-(2-methylpyrazol-3-yl)pyrrolo[2,3-d]pyrimidin-7-yl]-N-(5-pyrazin-2-yl-2-pyridyl)acetamide | US10202375, Example 18
TypeSmall organic molecule
Emp. Form.C21H17N9O
Mol. Mass.411.4194
SMILESCn1nccc1-c1ncnc2n(CC(=O)Nc3ccc(cn3)-c3cnccn3)ccc12