Reaction Details
TargetProtein Wnt-3a
LigandBDBM346256
Substrate/Competitorn/a
Meas. Tech.Dual-Cell beta-Catenin Reporter Assay
IC50>5±n/a nM
Citation Bhamra, IMathieson, MDonoghue, CTestar, R N-pyridinyl acetamide derivatives as Wnt signalling pathway inhibitors US Patent US10202375 Publication Date 2/12/2019
 
Protein Wnt-3a
Name:Protein Wnt-3a
Type:PROTEIN
Mol. Mass.:39269.29
Organism:Mus musculus
Description:ChEMBL_813156
Residue:352
BDBM346256
NameBDBM346256
Synonyms:2-[6-(2-methyl-4-pyridyl)purin-9-yl]-N-(5-pyrazin-2-yl-2-pyridyl)acetamide | US10202375, Example 19
TypeSmall organic molecule
Emp. Form.C22H17N9O
Mol. Mass.423.4301
SMILESCc1cc(ccn1)-c1ncnc2n(CC(=O)Nc3ccc(cn3)-c3cnccn3)cnc12