Reaction Details
TargetProtein Wnt-3a
LigandBDBM346268
Substrate/Competitorn/a
Meas. Tech.Dual-Cell beta-Catenin Reporter Assay
IC50<1±n/a nM
Citation Bhamra, IMathieson, MDonoghue, CTestar, R N-pyridinyl acetamide derivatives as Wnt signalling pathway inhibitors US Patent US10202375 Publication Date 2/12/2019
 
Protein Wnt-3a
Name:Protein Wnt-3a
Type:PROTEIN
Mol. Mass.:39269.29
Organism:Mus musculus
Description:ChEMBL_813156
Residue:352
BDBM346268
NameBDBM346268
Synonyms:2-[4-(2-methylpyrazol-3-yl)pyrrolo[2,3-b]pyridin-1-yl]-N-(5-pyrazin-2-yl-2-pyridyl)acetamide | US10202375, Example 31
TypeSmall organic molecule
Emp. Form.C22H18N8O
Mol. Mass.410.4313
SMILESCn1nccc1-c1ccnc2n(CC(=O)Nc3ccc(cn3)-c3cnccn3)ccc12