Reaction Details
TargetLysine-specific demethylase 4C
LigandBDBM296095
Substrate/Competitorn/a
Meas. Tech.JMJD2C Assay
IC50<100±n/a nM
Citation Boloor, AKanouni, TStafford, JAVeal, JMWallace, MB Histone demethylase inhibitors US Patent US10202381 Publication Date 2/12/2019
 
Lysine-specific demethylase 4C
Name:Lysine-specific demethylase 4C
Type:Protein
Mol. Mass.:119979.01
Organism:Homo sapiens (Human)
Description:Q9H3R0
Residue:1056
BDBM296095
NameBDBM296095
Synonyms:2-(4-{methyl-[3-(4-methyl-piperazin-1-yl)- phenyl]-amino}-phenoxy)-pyrido[3,4-d] pyrimidin-4-ol US10112940, Example 79 US10208039, Example 79 US10815234, Example 79 | US11535616, Example 22
TypeSmall organic molecule
Emp. Form.C25H26N6O2
Mol. Mass.442.5129
SMILESCN(c1ccc(Oc2nc(O)c3ccncc3n2)cc1)c1cccc(c1)N1CCN(C)CC1