Reaction Details
TargetSomatostatin receptor type 4
LigandBDBM311904
Substrate/Competitorn/a
Meas. Tech.Radioligand Binding Assay
Ki 37.1±n/a nM
Citation Giovannini, RCui, YDoods, HFerrara, MJust, SKuelzer, RLingard, IMazzaferro, RRudolf, K Somatostatin receptor subtype 4 (SSTR4) agonists US Patent US9789082 Publication Date 10/17/2017
 
Somatostatin receptor type 4
Name:Somatostatin receptor type 4
Type:Enzyme
Mol. Mass.:42015.38
Organism:Homo sapiens (Human)
Description:P31391
Residue:388
BDBM311904
NameBDBM311904
Synonyms:US10166214, Example 40 US9789082, Example 40
TypeSmall organic molecule
Emp. Form.C17H24N2O2
Mol. Mass.288.3847
SMILESCc1ccccc1OCC(C)(C)NC(=O)[C@@H]1[C@H]2CNC[C@@H]12