Reaction Details
TargetSomatostatin receptor type 4
LigandBDBM311992
Substrate/Competitorn/a
Meas. Tech.Radioligand Binding Assay
Ki 7.60±n/a nM
Citation Giovannini, RCui, YDoods, HFerrara, MJust, SKuelzer, RLingard, IMazzaferro, RRudolf, K Somatostatin receptor subtype 4 (SSTR4) agonists US Patent US9789082 Publication Date 10/17/2017
 
Somatostatin receptor type 4
Name:Somatostatin receptor type 4
Type:Enzyme
Mol. Mass.:42015.38
Organism:Homo sapiens (Human)
Description:P31391
Residue:388
BDBM311992
NameBDBM311992
Synonyms:US10166214, Example 128 US9789082, Example 128
TypeSmall organic molecule
Emp. Form.C20H26N4O
Mol. Mass.338.4466
SMILESCc1cccn2c(nc(C3CC3)c12)C(C)(C)NC(=O)[C@@H]1[C@H]2CNC[C@@H]12