Reaction Details
TargetSomatostatin receptor type 4
LigandBDBM50081059
Substrate/Competitorn/a
Meas. Tech.Radioligand Binding Assay
Ki 70.3±n/a nM
Citation Giovannini, RCui, YDoods, HFerrara, MJust, SKuelzer, RLingard, IMazzaferro, RRudolf, K Somatostatin receptor subtype 4 (SSTR4) agonists US Patent US9789082 Publication Date 10/17/2017
 
Somatostatin receptor type 4
Name:Somatostatin receptor type 4
Type:Enzyme
Mol. Mass.:42015.38
Organism:Homo sapiens (Human)
Description:P31391
Residue:388
BDBM50081059
NameBDBM50081059
Synonyms:CHEMBL3421845 US10675268, Example 138 | US9789082, Example 138
TypeSmall organic molecule
Emp. Form.C18H22N4O
Mol. Mass.310.3935
SMILES[H][C@@]12CNC[C@]1([H])[C@H]2C(=O)NC(C)(C)c1nc(C)nc2ccccc12