Reaction Details
TargetDiacylglycerol O-acyltransferase 2
LigandBDBM323669
Substrate/Competitorn/a
Meas. Tech.In Vitro DGAT2 Assay
IC50 0.600±n/a nM
Citation Futatsugi, K Diacylglycerol acyltransferase 2 inhibitors US Patent US9789110 Publication Date 10/17/2017
 
Diacylglycerol O-acyltransferase 2
Name:Diacylglycerol O-acyltransferase 2
Type:Multi-pass membrane protein
Mol. Mass.:43848.90
Organism:Homo sapiens (Human)
Description:Q96PD7
Residue:388
BDBM323669
NameBDBM323669
Synonyms:(R)-(2-(3-(2- ethoxyphenoxy)piperidin- 1-yl)pyrimidin-5-yl)(3- phenoxyazetidin-1- yl)methanone US9789110, 21.2
TypeSmall organic molecule
Emp. Form.C27H30N4O4
Mol. Mass.474.5515
SMILESCCOc1ccccc1O[C@@H]1CCCN(C1)c1ncc(cn1)C(=O)N1CC(C1)Oc1ccccc1