Reaction Details
TargetHistone deacetylase 4
LigandBDBM347330
Substrate/Competitorn/a
Meas. Tech.Inhibition Assay
Ki 0.080±n/a nM
Citation Wright, DLAnderson, ACVan Heyst, MOnonye, S Substituted tropolone derivatives and methods of use US Patent US9790158 Publication Date 10/17/2017
 
Histone deacetylase 4
Name:Histone deacetylase 4
Type:Enzyme
Mol. Mass.:119049.39
Organism:Homo sapiens (Human)
Description:P56524
Residue:1084
BDBM347330
NameBDBM347330
Synonyms:MO-OH-PHE | US9790158, 1
TypeSmall organic molecule
Emp. Form.C13H10O2
Mol. Mass.198.2173
SMILESOc1ccccc(-c2ccccc2)c1=O