Reaction Details
TargetHistone deacetylase 8
LigandBDBM348883
Substrate/Competitorn/a
Meas. Tech.Inhibition Assay
Ki 19.4±n/a nM
Citation Wright, DLAnderson, ACVan Heyst, MOnonye, S Substituted tropolone derivatives and methods of use US Patent US9790158 Publication Date 10/17/2017
 
Histone deacetylase 8
Name:Histone deacetylase 8
Type:Enzyme
Mol. Mass.:41749.60
Organism:Homo sapiens (Human)
Description:Q9BY41
Residue:377
BDBM348883
NameBDBM348883
Synonyms:US9790158, 6
Typen/a
Emp. Form.C13H10O2
Mol. Mass.198.2173
SMILESOc1cc(cccc1=O)-c1ccccc1