Reaction Details
TargetHistone deacetylase 8
LigandBDBM347456
Substrate/Competitorn/a
Meas. Tech.Inhibition Assay
Ki 1.36±n/a nM
Citation Wright, DLAnderson, ACVan Heyst, MOnonye, S Substituted tropolone derivatives and methods of use US Patent US9790158 Publication Date 10/17/2017
 
Histone deacetylase 8
Name:Histone deacetylase 8
Type:Enzyme
Mol. Mass.:41749.60
Organism:Homo sapiens (Human)
Description:Q9BY41
Residue:377
BDBM347456
NameBDBM347456
Synonyms:US9790158, 7
TypeSmall organic molecule
Emp. Form.C14H12O3
Mol. Mass.228.2433
SMILESCOc1cccc(c1)-c1cccc(O)c(=O)c1