Reaction Details
TargetcGMP-inhibited 3',5'-cyclic phosphodiesterase 3B [387-1112]
LigandBDBM15319
Substrate/CompetitorBDBM10851
Meas. Tech.PDE SPA Enzyme Inhibition Assay
IC50 0.26±n/a nM
Citation Edmondson, SDMastracchio, AHe, JChung, CCForrest, MJHofsess, SMacIntyre, EMetzger, JO'Connor, NPatel, KTong, XTota, MRVan der Ploeg, LHVarnerin, JPFisher, MHWyvratt, MJWeber, AEParmee, ER Benzyl vinylogous amide substituted aryldihydropyridazinones and aryldimethylpyrazolones as potent and selective PDE3B inhibitors. Bioorg Med Chem Lett13:3983-7 (2003) 
 
cGMP-inhibited 3',5'-cyclic phosphodiesterase 3B [387-1112]
Name:cGMP-inhibited 3',5'-cyclic phosphodiesterase 3B [387-1112]
Type:Enzyme
Mol. Mass.:81944.98
Organism:Homo sapiens (Human)
Description:PDE3B (387-1112) was expressed as soluble proteins in Escherichia coli.
Residue:726
BDBM15319
BDBM10851
NameBDBM15319
Synonyms:6-{4-[(2-benzyl-3-oxocyclohex-1-en-1-yl)amino]-3-fluorophenyl}-5-methyl-2,3,4,5-tetrahydropyridazin-3-one | dihydropyridazinone 14m
TypeSmall organic molecule
Emp. Form.C24H24FN3O2
Mol. Mass.405.4647
SMILESCC1CC(=O)NN=C1c1ccc(NC2=C(Cc3ccccc3)C(=O)CCC2)c(F)c1