Reaction Details
TargetHeat shock protein HSP 90-beta
LigandBDBM15410
Substrate/CompetitorBDBM15360
Meas. Tech.Fluorescence Polarization (FP) Assay
pH7.4±n/a
Temperature295.15±n/a K
IC50 600±n/a nM
Citation Barril, XBrough, PDrysdale, MHubbard, REMassey, ASurgenor, AWright, L Structure-based discovery of a new class of Hsp90 inhibitors. Bioorg Med Chem Lett15:5187-91 (2005) 
 
Heat shock protein HSP 90-beta
Name:Heat shock protein HSP 90-beta
Type:Molecular Chaperone
Mol. Mass.:83229.45
Organism:Homo sapiens (Human)
Description:P08238
Residue:724
BDBM15410
BDBM15360
NameBDBM15410
Synonyms:N-[4-hydroxy-3-(2-hydroxynaphthalen-1-yl)phenyl]thiophene-2-sulfonamide | naphthol compound 13
TypeSmall organic molecule
Emp. Form.C20H15NO4S2
Mol. Mass.397.467
SMILESOc1ccc(NS(=O)(=O)c2cccs2)cc1-c1c(O)ccc2ccccc12