Reaction Details
TargetDipeptidyl peptidase 4
LigandBDBM15515
Substrate/CompetitorBDBM11057
Meas. Tech.DPP Inhibition Assay
pH7.5±n/a
Temperature295.15±n/a K
Ki 3.8±n/a nM
Citation Pei, ZLi, Xvon Geldern, TWLongenecker, KPireh, DStewart, KDBackes, BJLai, CLubben, THBallaron, SJBeno, DWKempf-Grote, AJSham, HLTrevillyan, JM Discovery and structure-activity relationships of piperidinone- and piperidine-constrained phenethylamines as novel, potent, and selective dipeptidyl peptidase IV inhibitors. J Med Chem50:1983-7 (2007) 
 
Dipeptidyl peptidase 4
Name:Dipeptidyl peptidase 4
Type:Enzyme
Mol. Mass.:88271.01
Organism:Homo sapiens (Human)
Description:P27487
Residue:766
BDBM15515
BDBM11057
NameBDBM15515
Synonyms:3-(2-((4R,5R)-5-amino-2-oxo-4-(2,4,5-trifluorophenyl)piperidin-1-yl)ethyl)benzoic acid Piperidinone-Constrained Phenethylamine 35
TypeSmall organic molecule
Emp. Form.C20H19F3N2O3
Mol. Mass.392.3717
SMILESN[C@H]1CN(CCc2cccc(c2)C(O)=O)C(=O)C[C@@H]1c1cc(F)c(F)cc1F