Reaction Details
Target15-hydroxyprostaglandin dehydrogenase [NAD(+)]
LigandBDBM347365
Substrate/Competitorn/a
Meas. Tech.In Vitro Assay
IC50 0.970±n/a nM
Citation Markowitz, SWillson, JKPosner, BAReady, JZhang, YTai, HAntczak, MGerson, SBae, KYang, SYDesai, A Compositions and methods of modulating 15-PGDH activity US Patent US9790233 Publication Date 10/17/2017
 
15-hydroxyprostaglandin dehydrogenase [NAD(+)]
Name:15-hydroxyprostaglandin dehydrogenase [NAD(+)]
Type:Enzyme
Mol. Mass.:28974.46
Organism:Homo sapiens (Human)
Description:P15428
Residue:266
BDBM347365
NameBDBM347365
Synonyms:US10301320, ID SW206992 US20230285402, ID # SW206992 | US9789116, SW206992
TypeSmall organic molecule
Emp. Form.C14H15N3OS3
Mol. Mass.337.483
SMILESCCCCS(=O)c1sc2nc(ccc2c1N)-c1nccs1