Reaction Details
Target15-hydroxyprostaglandin dehydrogenase [NAD(+)]
LigandBDBM347368
Substrate/Competitorn/a
Meas. Tech.In Vitro Assay
IC50 1.37±n/a nM
Citation Markowitz, SWillson, JKPosner, BAReady, JZhang, YTai, HAntczak, MGerson, SBae, KYang, SYDesai, A Compositions and methods of modulating 15-PGDH activity US Patent US9790233 Publication Date 10/17/2017
 
15-hydroxyprostaglandin dehydrogenase [NAD(+)]
Name:15-hydroxyprostaglandin dehydrogenase [NAD(+)]
Type:Enzyme
Mol. Mass.:28974.46
Organism:Homo sapiens (Human)
Description:P15428
Residue:266
BDBM347368
NameBDBM347368
Synonyms:US10301320, ID SW208066 US20230285402, ID # SW208066 | US9789116, SW208066
TypeSmall organic molecule
Emp. Form.C20H19N3OS3
Mol. Mass.413.579
SMILESCCCCS(=O)c1sc2nc(cc(-c3ccccc3)c2c1N)-c1nccs1