Reaction Details
TargetLysine-specific histone demethylase 1A
LigandBDBM283128
Substrate/Competitorn/a
Meas. Tech.In Vitro Enzyme Inhibition Assay LSD-1
IC50<100±n/a nM
Citation Chen, YKKanouni, TKaldor, SWStafford, JAVeal, JM Inhibitors of lysine specific demethylase-1 US Patent US10207999 Publication Date 2/19/2019
 
Lysine-specific histone demethylase 1A
Name:Lysine-specific histone demethylase 1A
Type:Enzyme
Mol. Mass.:92901.01
Organism:Homo sapiens (Human)
Description:O60341
Residue:852
BDBM283128
NameBDBM283128
Synonyms:4-(2-(4-aminopiperidin-1-yl)- 1-methyl-6-oxo-5-p-tolyl-1,6- dihydropyrimidin-4-yl)-benzonitrile US10207999, Example 1 US10548896, Example 1 US10960005, Example 1 US9573930, Example 1 US9776974, Example 1
TypeSmall organic molecule
Emp. Form.C24H25N5O
Mol. Mass.399.4882
SMILESCc1ccc(cc1)-c1c(nc(N2CCC(N)CC2)n(C)c1=O)-c1ccc(cc1)C#N