Reaction Details
TargetLysine-specific histone demethylase 1A
LigandBDBM283215
Substrate/Competitorn/a
Meas. Tech.In Vitro Enzyme Inhibition Assay LSD-1
IC50<100±n/a nM
Citation Chen, YKKanouni, TKaldor, SWStafford, JAVeal, JM Inhibitors of lysine specific demethylase-1 US Patent US10207999 Publication Date 2/19/2019
 
Lysine-specific histone demethylase 1A
Name:Lysine-specific histone demethylase 1A
Type:Enzyme
Mol. Mass.:92901.01
Organism:Homo sapiens (Human)
Description:O60341
Residue:852
BDBM283215
NameBDBM283215
Synonyms:4-[2-(4-amino-piperidin-1-yl)-5- (4-methoxyphenyl)-1-methyl-6-oxo- 1,6-dihydro-pyrimidin-4-yl]- 2-fluorobenzonitrile US10207999, Example 6 US10548896, Example 6 US10960005, Example 6 US9573930, Example 6 US9776974, Example 6
TypeSmall organic molecule
Emp. Form.C24H24FN5O2
Mol. Mass.433.4781
SMILESCOc1ccc(cc1)-c1c(nc(N2CCC(N)CC2)n(C)c1=O)-c1ccc(C#N)c(F)c1