Reaction Details
TargetLysine-specific histone demethylase 1A
LigandBDBM283217
Substrate/Competitorn/a
Meas. Tech.In Vitro Enzyme Inhibition Assay LSD-1
IC50<100±n/a nM
Citation Chen, YKKanouni, TKaldor, SWStafford, JAVeal, JM Inhibitors of lysine specific demethylase-1 US Patent US10207999 Publication Date 2/19/2019
 
Lysine-specific histone demethylase 1A
Name:Lysine-specific histone demethylase 1A
Type:Enzyme
Mol. Mass.:92901.01
Organism:Homo sapiens (Human)
Description:O60341
Residue:852
BDBM283217
NameBDBM283217
Synonyms:4-[2-(4-amino-piperidin-1-yl)-5- (6-methoxypyridin-3-yl)-1- methyl-6-oxo-1,6-dihydro- pyrimidin-4-yl]-2-fluoro- benzonitrile US10207999, Example 8 US10548896, Example 8 US10960005, Example 8 US9573930, Example 8 US9776974, Example 8
TypeSmall organic molecule
Emp. Form.C23H23FN6O2
Mol. Mass.434.4661
SMILESCOc1ccc(cn1)-c1c(nc(N2CCC(N)CC2)n(C)c1=O)-c1ccc(C#N)c(F)c1