Reaction Details
TargetLysine-specific histone demethylase 1A
LigandBDBM283226
Substrate/Competitorn/a
Meas. Tech.In Vitro Enzyme Inhibition Assay LSD-1
IC50<100±n/a nM
Citation Chen, YKKanouni, TKaldor, SWStafford, JAVeal, JM Inhibitors of lysine specific demethylase-1 US Patent US10207999 Publication Date 2/19/2019
 
Lysine-specific histone demethylase 1A
Name:Lysine-specific histone demethylase 1A
Type:Enzyme
Mol. Mass.:92901.01
Organism:Homo sapiens (Human)
Description:O60341
Residue:852
BDBM283226
NameBDBM283226
Synonyms:2-[2-(4-amino-piperidin-1-yl)-4- (4-cyano-3-fluoro-phenyl)-5-(4- methoxy-phenyl)-6-oxo-6H- pyrimidin-1-yl]-acetamide US10207999, Example 16 US10548896, Example 16 US10960005, Example 16 US9573930, Example 16 US9776974, Example 16
TypeSmall organic molecule
Emp. Form.C25H25FN6O3
Mol. Mass.476.5028
SMILESCOc1ccc(cc1)-c1c(nc(N2CCC(N)CC2)n(CC(N)=O)c1=O)-c1ccc(C#N)c(F)c1