Reaction Details
TargetLysine-specific histone demethylase 1A
LigandBDBM283228
Substrate/Competitorn/a
Meas. Tech.In Vitro Enzyme Inhibition Assay LSD-1
IC50<100±n/a nM
Citation Chen, YKKanouni, TKaldor, SWStafford, JAVeal, JM Inhibitors of lysine specific demethylase-1 US Patent US10207999 Publication Date 2/19/2019
 
Lysine-specific histone demethylase 1A
Name:Lysine-specific histone demethylase 1A
Type:Enzyme
Mol. Mass.:92901.01
Organism:Homo sapiens (Human)
Description:O60341
Residue:852
BDBM283228
NameBDBM283228
Synonyms:4-[2-(4-amino-piperidin-1-yl)-5- benzofuran-5-yl-1-methyl-6-oxo- 1,6-dihydro-pyrimidin-4-yl]-2- fluoro-benzonitrile US10207999, Example 18 US10548896, Example 18 US10960005, Example 18 US9573930, Example 18 US9776974, Example 18
TypeSmall organic molecule
Emp. Form.C25H22FN5O2
Mol. Mass.443.4729
SMILESCn1c(nc(-c2ccc(C#N)c(F)c2)c(-c2ccc3occc3c2)c1=O)N1CCC(N)CC1