Reaction Details
TargetLysine-specific histone demethylase 1A
LigandBDBM283241
Substrate/Competitorn/a
Meas. Tech.In Vitro Enzyme Inhibition Assay LSD-1
IC50<100±n/a nM
Citation Chen, YKKanouni, TKaldor, SWStafford, JAVeal, JM Inhibitors of lysine specific demethylase-1 US Patent US10207999 Publication Date 2/19/2019
 
Lysine-specific histone demethylase 1A
Name:Lysine-specific histone demethylase 1A
Type:Enzyme
Mol. Mass.:92901.01
Organism:Homo sapiens (Human)
Description:O60341
Residue:852
BDBM283241
NameBDBM283241
Synonyms:4-[2-((3S)-3-amino-piperidin-1- yl)-5-(3-fluoro-4-methoxy-phenyl)- 1-methyl-6-oxo-1,6-dihydro- pyrimidin-4-yl]-2-fluoro- benzonitrile US10207999, Example 28 US10548896, Example 28 US10960005, Example 28 US9573930, Example 28 US9776974, Example 28
TypeSmall organic molecule
Emp. Form.C24H23F2N5O2
Mol. Mass.451.4685
SMILESCOc1ccc(cc1F)-c1c(nc(N2CCC[C@H](N)C2)n(C)c1=O)-c1ccc(C#N)c(F)c1