Reaction Details
TargetLysine-specific histone demethylase 1A
LigandBDBM283242
Substrate/Competitorn/a
Meas. Tech.In Vitro Enzyme Inhibition Assay LSD-1
IC50<100±n/a nM
Citation Chen, YKKanouni, TKaldor, SWStafford, JAVeal, JM Inhibitors of lysine specific demethylase-1 US Patent US10207999 Publication Date 2/19/2019
 
Lysine-specific histone demethylase 1A
Name:Lysine-specific histone demethylase 1A
Type:Enzyme
Mol. Mass.:92901.01
Organism:Homo sapiens (Human)
Description:O60341
Residue:852
BDBM283242
NameBDBM283242
Synonyms:4-[2-((3S)-3-amino-pyrrolidin-1-yl)- 5-(3-fluoro-4-methoxy-phenyl)-1- methyl-6-oxo-1,6-dihydro- pyrimidin-4-yl]-2-fluoro- benzonitrile US10207999, Example 29 US10548896, Example 29 US10960005, Example 29 US9573930, Example 29 US9776974, Example 29
TypeSmall organic molecule
Emp. Form.C23H21F2N5O2
Mol. Mass.437.4419
SMILESCOc1ccc(cc1F)-c1c(nc(N2CC[C@H](N)C2)n(C)c1=O)-c1ccc(C#N)c(F)c1