Reaction Details
TargetTyrosine-protein phosphatase non-receptor type 2
LigandBDBM15815
Substrate/CompetitorBDBM13466
Meas. Tech.PTP1B and TCPTP Inhibition Assay
Ki 270±n/a nM
Citation Xin, ZOost, TKAbad-Zapatero, CHajduk, PJPei, ZSzczepankiewicz, BGHutchins, CWBallaron, SJStashko, MALubben, TTrevillyan, JMJirousek, MRLiu, G Potent, selective inhibitors of protein tyrosine phosphatase 1B. Bioorg Med Chem Lett13:1887-90 (2003) 
 
Tyrosine-protein phosphatase non-receptor type 2
Name:Tyrosine-protein phosphatase non-receptor type 2
Type:Protein
Mol. Mass.:48481.80
Organism:Homo sapiens (Human)
Description:P17706
Residue:415
BDBM15815
BDBM13466
NameBDBM15815
Synonyms:1:1 mixture of diastereomers oxalyl-aryl-amino benzoic acid-based inhibitor 15
TypeSmall organic molecule
Emp. Form.C32H39N5O11
Mol. Mass.669.679
SMILESCCc1cc(CC(NC(C)=O)C(=O)NCCCCC(=O)N[C@@H](CCC(N)=O)C(O)=O)ccc1N(C(=O)C(O)=O)c1ccccc1C(O)=O