Reaction Details
TargetCoagulation factor X
LigandBDBM15863
Substrate/CompetitorBDBM12500
Meas. Tech.Factor Xa Inhibition Assay
pH7.8±n/a
Temperature298.15±n/a K
Ki 4±n/a nM
Citation Nazare, MEssrich, MWill, DWMatter, HRitter, KUrmann, MBauer, ASchreuder, HDudda, ACzech, JLorenz, MLaux, VWehner, V Factor Xa inhibitors based on a 2-carboxyindole scaffold: SAR of neutral P1 substituents. Bioorg Med Chem Lett14:4191-5 (2004) 
 
Coagulation factor X
Name:Coagulation factor X
Type:Enzyme
Mol. Mass.:54726.60
Organism:Homo sapiens (Human)
Description:n/a
Residue:488
BDBM15863
BDBM12500
NameBDBM15863
Synonyms:1-{[5-(5-chlorothiophen-2-yl)-1,3,4-thiadiazol-2-yl]methyl}-N-[1-(propan-2-yl)piperidin-4-yl]-1H-indole-2-carboxamide | 2-carboxyindole 24
TypeSmall organic molecule
Emp. Form.C24H26ClN5OS2
Mol. Mass.500.079
SMILESCC(C)N1CCC(CC1)NC(=O)c1cc2ccccc2n1Cc1nnc(s1)-c1ccc(Cl)s1