Reaction Details
TargetP2X purinoceptor 7
LigandBDBM160087
Substrate/Competitorn/a
Meas. Tech.Radioligand binding assay
Ki 3.20±n/a nM
Citation Ameriks, MKRech, JCSavall, BM Substituted [1,2,4]triazolo[4,3-a]pyrazines as P2X7 modulators US Patent US10047092 Publication Date 8/14/2018
 
P2X purinoceptor 7
Name:P2X purinoceptor 7
Type:Protein
Mol. Mass.:68602.85
Organism:Homo sapiens (Human)
Description:Q99572
Residue:595
BDBM160087
NameBDBM160087
Synonyms:US10047092, 28 US9040534, 28
TypeSmall organic molecule
Emp. Form.C17H14ClF3N6O
Mol. Mass.410.781
SMILESC[C@H]1Cn2c(nnc2C(=O)N1Cc1cccc(c1Cl)C(F)(F)F)-c1cc[nH]n1