Reaction Details
TargetP2X purinoceptor 7
LigandBDBM160091
Substrate/Competitorn/a
Meas. Tech.Radioligand binding assay
Ki 0.400±n/a nM
Citation Ameriks, MKRech, JCSavall, BM Substituted [1,2,4]triazolo[4,3-a]pyrazines as P2X7 modulators US Patent US10047092 Publication Date 8/14/2018
 
P2X purinoceptor 7
Name:P2X purinoceptor 7
Type:Protein
Mol. Mass.:68403.50
Organism:Rattus norvegicus (Rat)
Description:Q64663
Residue:595
BDBM160091
NameBDBM160091
Synonyms:US10047092, 32 US9040534, 32
TypeSmall organic molecule
Emp. Form.C17H13ClF3N5OS
Mol. Mass.427.831
SMILESC[C@H]1Cn2c(nnc2C(=O)N1Cc1cccc(c1Cl)C(F)(F)F)-c1cscn1