Reaction Details
TargetUrokinase-type plasminogen activator
LigandBDBM16128
Substrate/CompetitorBDBM14716
Meas. Tech.Determination of Inhibitor Potency and Selectivity
pH8.1±n/a
Temperature310.15±n/a K
Ki 6000±n/a nM
Km90000±n/a nM
Citation Fish, PVBarber, CGBrown, DGButt, RCollis, MGDickinson, RPHenry, BTHorne, VAHuggins, JPKing, EO'gara, MMcCleverty, DMcIntosh, FPhillips, CWebster, R Selective Urokinase-Type Plasminogen Activator Inhibitors. 4. 1-(7-Sulfonamidoisoquinolinyl)guanidines. J Med Chem50:2341-51 (2007) 
 
Urokinase-type plasminogen activator
Name:Urokinase-type plasminogen activator
Type:Enzyme
Mol. Mass.:48528.62
Organism:Homo sapiens (Human)
Description:P00749
Residue:431
BDBM16128
BDBM14716
NameBDBM16128
Synonyms:4-(trifluoromethyl)benzene-1-guanidine phenylguanidine 2
TypeSmall organic molecule
Emp. Form.C8H8F3N3
Mol. Mass.203.1644
SMILESNC(=N)Nc1ccc(cc1)C(F)(F)F