Reaction Details
TargetUrokinase-type plasminogen activator
LigandBDBM16132
Substrate/CompetitorBDBM14716
Meas. Tech.Determination of Inhibitor Potency and Selectivity
pH8.1±n/a
Temperature310.15±n/a K
Ki 140±n/a nM
Km90000±n/a nM
Citation Fish, PVBarber, CGBrown, DGButt, RCollis, MGDickinson, RPHenry, BTHorne, VAHuggins, JPKing, EO'gara, MMcCleverty, DMcIntosh, FPhillips, CWebster, R Selective Urokinase-Type Plasminogen Activator Inhibitors. 4. 1-(7-Sulfonamidoisoquinolinyl)guanidines. J Med Chem50:2341-51 (2007) 
 
Urokinase-type plasminogen activator
Name:Urokinase-type plasminogen activator
Type:Enzyme
Mol. Mass.:48528.62
Organism:Homo sapiens (Human)
Description:P00749
Residue:431
BDBM16132
BDBM14716
NameBDBM16132
Synonyms:1-guanidino-7-sulfonamidoisoquinoline 6 | 2-(4-chloro-7-sulfamoylisoquinolin-1-yl)guanidine
TypeSmall organic molecule
Emp. Form.C10H10ClN5O2S
Mol. Mass.299.737
SMILES[#7]\[#6](-[#7])=[#7]/c1ncc(Cl)c2ccc(cc12)S([#7])(=O)=O