Reaction Details
TargetUrokinase-type plasminogen activator
LigandBDBM16136
Substrate/CompetitorBDBM14716
Meas. Tech.Determination of Inhibitor Potency and Selectivity
pH8.1±n/a
Temperature310.15±n/a K
Ki 550±n/a nM
Km90000±n/a nM
Citation Fish, PVBarber, CGBrown, DGButt, RCollis, MGDickinson, RPHenry, BTHorne, VAHuggins, JPKing, EO'gara, MMcCleverty, DMcIntosh, FPhillips, CWebster, R Selective Urokinase-Type Plasminogen Activator Inhibitors. 4. 1-(7-Sulfonamidoisoquinolinyl)guanidines. J Med Chem50:2341-51 (2007) 
 
Urokinase-type plasminogen activator
Name:Urokinase-type plasminogen activator
Type:Enzyme
Mol. Mass.:48528.62
Organism:Homo sapiens (Human)
Description:P00749
Residue:431
BDBM16136
BDBM14716
NameBDBM16136
Synonyms:1-guanidino-7-sulfonamidoisoquinoline 10 | 2-{4-chloro-7-[(4-methylpiperazine-1-)sulfonyl]isoquinolin-1-yl}guanidine
TypeSmall organic molecule
Emp. Form.C15H19ClN6O2S
Mol. Mass.382.868
SMILES[#6]-[#7]-1-[#6]-[#6]-[#7](-[#6]-[#6]-1)S(=O)(=O)c1ccc2c(Cl)cnc(\[#7]=[#6](/[#7])-[#7])c2c1