Reaction Details
TargetUrokinase-type plasminogen activator
LigandBDBM16143
Substrate/CompetitorBDBM14716
Meas. Tech.Determination of Inhibitor Potency and Selectivity
Ki 29±n/a nM
Citation Fish, PVBarber, CGBrown, DGButt, RCollis, MGDickinson, RPHenry, BTHorne, VAHuggins, JPKing, EO'gara, MMcCleverty, DMcIntosh, FPhillips, CWebster, R Selective Urokinase-Type Plasminogen Activator Inhibitors. 4. 1-(7-Sulfonamidoisoquinolinyl)guanidines. J Med Chem50:2341-51 (2007) 
 
Urokinase-type plasminogen activator
Name:Urokinase-type plasminogen activator
Type:Enzyme
Mol. Mass.:48528.62
Organism:Homo sapiens (Human)
Description:P00749
Residue:431
BDBM16143
BDBM14716
NameBDBM16143
Synonyms:2-({4-chloro-1-[(diaminomethylidene)amino]isoquinoline-7-}(phenyl)sulfonamido)acetic acid | substituted glycine deriv. 17
TypeSmall organic molecule
Emp. Form.C18H16ClN5O4S
Mol. Mass.433.869
SMILES[#7]\[#6](-[#7])=[#7]/c1ncc(Cl)c2ccc(cc12)S(=O)(=O)[#7](-[#6]-[#6](-[#8])=O)-c1ccccc1