Reaction Details
TargetUrokinase-type plasminogen activator
LigandBDBM16157
Substrate/CompetitorBDBM14716
Meas. Tech.Determination of Inhibitor Potency and Selectivity
Ki 11±n/a nM
Citation Fish, PVBarber, CGBrown, DGButt, RCollis, MGDickinson, RPHenry, BTHorne, VAHuggins, JPKing, EO'gara, MMcCleverty, DMcIntosh, FPhillips, CWebster, R Selective Urokinase-Type Plasminogen Activator Inhibitors. 4. 1-(7-Sulfonamidoisoquinolinyl)guanidines. J Med Chem50:2341-51 (2007) 
 
Urokinase-type plasminogen activator
Name:Urokinase-type plasminogen activator
Type:Enzyme
Mol. Mass.:48528.62
Organism:Homo sapiens (Human)
Description:P00749
Residue:431
BDBM16157
BDBM14716
NameBDBM16157
Synonyms:4-({4-chloro-1-[(diaminomethylidene)amino]isoquinoline-7-}sulfonamido)-1-methylpiperidine-4-carboxylic acid | substituted glycine deriv. 31
TypeSmall organic molecule
Emp. Form.C17H21ClN6O4S
Mol. Mass.440.904
SMILES[#6]-[#7]-1-[#6]-[#6]C([#6]-[#6]-1)([#7]S(=O)(=O)c1ccc2c(Cl)cnc(\[#7]=[#6](/[#7])-[#7])c2c1)[#6](-[#8])=O