Reaction Details
TargetUrokinase-type plasminogen activator
LigandBDBM16158
Substrate/CompetitorBDBM14716
Meas. Tech.Determination of Inhibitor Potency and Selectivity
Ki 330±n/a nM
Citation Fish, PVBarber, CGBrown, DGButt, RCollis, MGDickinson, RPHenry, BTHorne, VAHuggins, JPKing, EO'gara, MMcCleverty, DMcIntosh, FPhillips, CWebster, R Selective Urokinase-Type Plasminogen Activator Inhibitors. 4. 1-(7-Sulfonamidoisoquinolinyl)guanidines. J Med Chem50:2341-51 (2007) 
 
Urokinase-type plasminogen activator
Name:Urokinase-type plasminogen activator
Type:Enzyme
Mol. Mass.:48528.62
Organism:Homo sapiens (Human)
Description:P00749
Residue:431
BDBM16158
BDBM14716
NameBDBM16158
Synonyms:1-({4-chloro-1-[(diaminomethylidene)amino]isoquinoline-7-}sulfonyl)azetidine-3-carboxylic acid | cyclic deriv. 32
TypeSmall organic molecule
Emp. Form.C14H14ClN5O4S
Mol. Mass.383.81
SMILES[#7]\[#6](-[#7])=[#7]/c1ncc(Cl)c2ccc(cc12)S(=O)(=O)[#7]-1-[#6]-[#6](-[#6]-1)-[#6](-[#8])=O