Reaction Details
TargetUrokinase-type plasminogen activator
LigandBDBM16166
Substrate/CompetitorBDBM14716
Meas. Tech.Determination of Inhibitor Potency and Selectivity
Ki 14±n/a nM
Citation Fish, PVBarber, CGBrown, DGButt, RCollis, MGDickinson, RPHenry, BTHorne, VAHuggins, JPKing, EO'gara, MMcCleverty, DMcIntosh, FPhillips, CWebster, R Selective Urokinase-Type Plasminogen Activator Inhibitors. 4. 1-(7-Sulfonamidoisoquinolinyl)guanidines. J Med Chem50:2341-51 (2007) 
 
Urokinase-type plasminogen activator
Name:Urokinase-type plasminogen activator
Type:Enzyme
Mol. Mass.:48528.62
Organism:Homo sapiens (Human)
Description:P00749
Residue:431
BDBM16166
BDBM14716
NameBDBM16166
Synonyms:cycloleucine deriv. 40 | ethyl 1-({4-chloro-1-[(diaminomethylidene)amino]isoquinoline-7-}sulfonamido)cyclopentane-1-carboxylate
TypeSmall organic molecule
Emp. Form.C18H22ClN5O4S
Mol. Mass.439.916
SMILES[#6]-[#6]-[#8]-[#6](=O)C1([#6]-[#6]-[#6]-[#6]1)[#7]S(=O)(=O)c1ccc2c(Cl)cnc(\[#7]=[#6](/[#7])-[#7])c2c1