Reaction Details
TargetUrokinase-type plasminogen activator
LigandBDBM16169
Substrate/CompetitorBDBM14716
Meas. Tech.Determination of Inhibitor Potency and Selectivity
Ki 10±n/a nM
Citation Fish, PVBarber, CGBrown, DGButt, RCollis, MGDickinson, RPHenry, BTHorne, VAHuggins, JPKing, EO'gara, MMcCleverty, DMcIntosh, FPhillips, CWebster, R Selective Urokinase-Type Plasminogen Activator Inhibitors. 4. 1-(7-Sulfonamidoisoquinolinyl)guanidines. J Med Chem50:2341-51 (2007) 
 
Urokinase-type plasminogen activator
Name:Urokinase-type plasminogen activator
Type:Enzyme
Mol. Mass.:48528.62
Organism:Homo sapiens (Human)
Description:P00749
Residue:431
BDBM16169
BDBM14716
NameBDBM16169
Synonyms:1-({4-chloro-1-[(diaminomethylidene)amino]isoquinoline-7-}sulfonamido)-N-(2-hydroxyethyl)cyclopentane-1-carboxamide | cycloleucine deriv. 43
TypeSmall organic molecule
Emp. Form.C18H23ClN6O4S
Mol. Mass.454.931
SMILES[#7]\[#6](-[#7])=[#7]/c1ncc(Cl)c2ccc(cc12)S(=O)(=O)[#7]C1([#6]-[#6]-[#6]-[#6]1)[#6](=O)-[#7]-[#6]-[#6]-[#8]