Reaction Details
TargetTissue-type plasminogen activator
LigandBDBM16131
Substrate/CompetitorBDBM14715
Meas. Tech.Determination of Inhibitor Potency and Selectivity
Ki 15000±n/a nM
Citation Fish, PVBarber, CGBrown, DGButt, RCollis, MGDickinson, RPHenry, BTHorne, VAHuggins, JPKing, EO'gara, MMcCleverty, DMcIntosh, FPhillips, CWebster, R Selective Urokinase-Type Plasminogen Activator Inhibitors. 4. 1-(7-Sulfonamidoisoquinolinyl)guanidines. J Med Chem50:2341-51 (2007) 
 
Tissue-type plasminogen activator
Name:Tissue-type plasminogen activator
Type:Enzyme
Mol. Mass.:62931.08
Organism:Homo sapiens (Human)
Description:n/a
Residue:562
BDBM16131
BDBM14715
NameBDBM16131
Synonyms:1-guanidino-7-sulfonamidoisoquinoline 5 | 2-[7-(phenylsulfamoyl)isoquinolin-1-yl]guanidine
TypeSmall organic molecule
Emp. Form.C16H15N5O2S
Mol. Mass.341.388
SMILES[#7]\[#6](-[#7])=[#7]/c1nccc2ccc(cc12)S(=O)(=O)[#7]-c1ccccc1