Reaction Details
TargetPlasminogen
LigandBDBM16130
Substrate/CompetitorBDBM12679
Meas. Tech.Determination of Inhibitor Potency and Selectivity
Ki 13000±n/a nM
Citation Fish, PVBarber, CGBrown, DGButt, RCollis, MGDickinson, RPHenry, BTHorne, VAHuggins, JPKing, EO'gara, MMcCleverty, DMcIntosh, FPhillips, CWebster, R Selective Urokinase-Type Plasminogen Activator Inhibitors. 4. 1-(7-Sulfonamidoisoquinolinyl)guanidines. J Med Chem50:2341-51 (2007) 
 
Plasminogen
Name:Plasminogen
Type:Enzyme
Mol. Mass.:90579.18
Organism:Homo sapiens (Human)
Description:n/a
Residue:810
BDBM16130
BDBM12679
NameBDBM16130
Synonyms:1-guanidino-7-sulfonamidoisoquinoline 4 | 2-(7-sulfamoylisoquinolin-1-yl)guanidine
TypeSmall organic molecule
Emp. Form.C10H11N5O2S
Mol. Mass.265.292
SMILES[#7]\[#6](-[#7])=[#7]/c1nccc2ccc(cc12)S([#7])(=O)=O