Reaction Details
TargetPlasminogen
LigandBDBM16138
Substrate/CompetitorBDBM12679
Meas. Tech.Determination of Inhibitor Potency and Selectivity
Ki 9800±n/a nM
Citation Fish, PVBarber, CGBrown, DGButt, RCollis, MGDickinson, RPHenry, BTHorne, VAHuggins, JPKing, EO'gara, MMcCleverty, DMcIntosh, FPhillips, CWebster, R Selective Urokinase-Type Plasminogen Activator Inhibitors. 4. 1-(7-Sulfonamidoisoquinolinyl)guanidines. J Med Chem50:2341-51 (2007) 
 
Plasminogen
Name:Plasminogen
Type:Enzyme
Mol. Mass.:90579.18
Organism:Homo sapiens (Human)
Description:n/a
Residue:810
BDBM16138
BDBM12679
NameBDBM16138
Synonyms:1-guanidino-7-sulfonamidoisoquinoline 12 | 3-({4-chloro-1-[(diaminomethylidene)amino]isoquinoline-7-}sulfonamido)benzoic acid
TypeSmall organic molecule
Emp. Form.C17H14ClN5O4S
Mol. Mass.419.842
SMILES[#7]\[#6](-[#7])=[#7]/c1ncc(Cl)c2ccc(cc12)S(=O)(=O)[#7]-c1cccc(c1)-[#6](-[#8])=O