Reaction Details
TargetLysosomal acid glucosylceramidase
LigandBDBM50182801
Substrate/Competitorn/a
Meas. Tech.Inhibition Assay
Ki 1.70±n/a nM
Citation Kaul, RMcEachern, EJSun, JVocadlo, DJZhou, YZhu, Y Glucocerebrosidase modulators and uses thereof US Patent US9796680 Publication Date 10/24/2017
 
Lysosomal acid glucosylceramidase
Name:Lysosomal acid glucosylceramidase
Type:Enzyme
Mol. Mass.:59724.64
Organism:Homo sapiens (Human)
Description:The beta-Glu activity was measured with commercially available beta-glucocerebrosidase (Ceredase) as the enzyme source.
Residue:536
BDBM50182801
NameBDBM50182801
Synonyms:(3R,4R,5R)-5-(Hydroxymethyl)piperidine-3,4-diol, 8 5-HYDROXYMETHYL-3,4-DIHYDROXYPIPERIDINE CHEMBL206468 US10081601, Example 1.1 isofagomine
TypeSmall organic molecule
Emp. Form.C6H13NO3
Mol. Mass.147.1723
SMILESOC[C@H]1CNC[C@@H](O)[C@@H]1O