Reaction Details
TargetLysosomal acid glucosylceramidase
LigandBDBM285834
Substrate/Competitorn/a
Meas. Tech.Inhibition Assay
Ki 7.60±n/a nM
Citation Kaul, RMcEachern, EJSun, JVocadlo, DJZhou, YZhu, Y Glucocerebrosidase modulators and uses thereof US Patent US9796680 Publication Date 10/24/2017
 
Lysosomal acid glucosylceramidase
Name:Lysosomal acid glucosylceramidase
Type:Enzyme
Mol. Mass.:59724.64
Organism:Homo sapiens (Human)
Description:The beta-Glu activity was measured with commercially available beta-glucocerebrosidase (Ceredase) as the enzyme source.
Residue:536
BDBM285834
NameBDBM285834
Synonyms:(6R,7R,8S)-8-vinyl-4-azaspiro[2.5]octane-6,7-diol US9796680, Example 16
TypeSmall organic molecule
Emp. Form.C9H15NO2
Mol. Mass.169.2209
SMILESO[C@@H]1CNC2(CC2)[C@H](C=C)[C@H]1O