Reaction Details
TargetEnoyl-[acyl-carrier-protein] reductase [NADH]
LigandBDBM8726
Substrate/CompetitorBDBM16293
Meas. Tech.Enoyl-CoA Reductase Inhibition Assay
pH6.8±n/a
Temperature295.15±n/a K
IC50 1000±100 nM
Citation Sullivan, TJTruglio, JJBoyne, MENovichenok, PZhang, XStratton, CFLi, HJKaur, TAmin, AJohnson, FSlayden, RAKisker, CTonge, PJ High affinity InhA inhibitors with activity against drug-resistant strains of Mycobacterium tuberculosis. ACS Chem Biol1:43-53 (2006) 
 
Enoyl-[acyl-carrier-protein] reductase [NADH]
Name:Enoyl-[acyl-carrier-protein] reductase [NADH]
Type:Enzyme
Mol. Mass.:28526.00
Organism:Mycobacterium tuberculosis (strain ATCC 25618 / H37Rv)
Description:P9WGR1
Residue:269
BDBM8726
BDBM16293
NameBDBM8726
Synonyms:5-chloro-2-(2,4-dichlorophenoxy)phenol TCL US20230414581, Compound 35
TypeSmall organic molecule
Emp. Form.C12H7Cl3O2
Mol. Mass.289.542
SMILESOc1cc(Cl)ccc1Oc1ccc(Cl)cc1Cl