Reaction Details
TargetEnoyl-[acyl-carrier-protein] reductase [NADH]
LigandBDBM16296
Substrate/CompetitorBDBM16293
Meas. Tech.Measurement of Inhibition Constants
pH6.8±n/a
Temperature295.15±n/a K
Ki 11.8±4.5 nM
Km29000±n/a nM
Citation Sullivan, TJTruglio, JJBoyne, MENovichenok, PZhang, XStratton, CFLi, HJKaur, TAmin, AJohnson, FSlayden, RAKisker, CTonge, PJ High affinity InhA inhibitors with activity against drug-resistant strains of Mycobacterium tuberculosis. ACS Chem Biol1:43-53 (2006) 
 
Enoyl-[acyl-carrier-protein] reductase [NADH]
Name:Enoyl-[acyl-carrier-protein] reductase [NADH]
Type:Enzyme
Mol. Mass.:28526.00
Organism:Mycobacterium tuberculosis (strain ATCC 25618 / H37Rv)
Description:P9WGR1
Residue:269
BDBM16296
BDBM16293
NameBDBM16296
Synonyms:5-Pentyl-2-phenoxy-phenol 5-pentyl-2-phenoxyphenol AIDS227445 | PT03
TypeSmall organic molecule
Emp. Form.C17H20O2
Mol. Mass.256.3395
SMILESCCCCCc1ccc(Oc2ccccc2)c(O)c1